{"text_format":"1","workbook":"xlsx","n_sheets":16,"sheets":["spis ark","1_wniosek","harm_pożyczki es","Wniosek _1","1","2","2_zał_H_zabezp","3_Zał_F_dane fin i zał_klient","4","5","3a_projekcje_klient ","3_Zał_F_TISE","7","4_założenia KO","5_projekcje","10"],"not_rendered":{"charts":0,"images":6,"macros":1,"external_links":0,"defined_names":10,"comments":0,"pivot_tables":0},"unopened":[],"bounds":{"document_bytes":16777216,"sheet_cells":100000,"rows_first":2000,"rows_last":500,"rows_between":2000,"halvings":0,"cell_chars":16384,"cell_head_chars":4096},"cells_cut":0,"cells_raw":0,"read":"whole","date_system":"1900"}

{"sheet":"spis ark","index":0,"n_rows":13,"n_cols":4,"rows_kept":13,"cut":false,"hidden":true,"merged":[]}
["nr  arkusza","tematyka","uwagi"]
[1,"wniosek"]
[2,"załącznik B","oswiadczenie  o MSP"]
[3,"załącznik  H zabezpieczenia","do uzgodnienia"]
[4,"załącznik oświadczenie o wykluczeniu","oświadczenie że nie podlega wykluczeniu z ubiegania się o dofinansowanie na podst art. 207 Ustawy o finansach pulicznych"]
[5,"założenia i przepływy z nowego przedsięwzięcia"]
{"$rows_left_out":8}
{"sheet":"1_wniosek","index":1,"n_rows":265,"n_cols":29,"rows_kept":265,"cut":false,"hidden":false,"merged":[[5,12,6,13],[75,2,75,8],[199,2,199,3],[200,2,200,3],[156,2,156,3],[111,2,111,8],[113,2,113,8],[115,2,115,8],[116,2,116,8],[117,2,117,8],[107,2,107,8],[96,2,96,8],[97,2,97,7],[90,5,90,8],[5,4,5,10],[6,4,6,10],[39,2,39,8],[40,2,40,4],[9,2,9,10],[118,2,119,8],[114,2,114,8],[112,2,112,8],[184,9,185,9],[10,2,10,10],[262,2,262,3],[261,5,261,10],[262,5,262,10],[183,2,183,13],[184,13,185,13],[201,2,201,3],[197,2,197,3],[260,2,260,3],[261,2,261,3],[256,2,256,3],[256,5,256,8],[228,2,228,8],[206,2,206,3],[205,2,205,3],[203,2,203,3],[202,2,202,3],[193,2,193,3],[184,2,186,3],[204,2,204,3],[210,2,210,7],[212,2,212,7],[213,2,213,7],[211,2,211,8],[229,2,229,8],[153,2,153,3],[159,2,159,3],[121,2,121,13],[175,2,175,3],[176,2,176,3],[177,2,177,3],[173,2,174,3],[184,12,185,12],[184,11,185,11],[157,2,157,3],[158,2,158,3],[168,2,168,3],[169,2,169,3],[163,2,163,13],[180,2,180,4],[180,5,180,13],[171,2,171,13],[172,2,172,13],[173,4,173,7],[11,2,11,10],[12,2,12,10],[13,2,13,10],[14,2,14,10],[8,5,8,7],[33,2,33,3],[34,2,34,3],[5,2,5,3],[6,2,6,3],[8,2,8,3],[18,2,18,3],[28,2,28,3],[18,4,18,10],[21,2,21,10],[22,4,22,10],[23,4,23,10],[35,2,35,3],[41,2,41,4],[41,5,41,8],[36,4,36,10],[37,4,37,10],[38,4,38,10],[74,2,74,8],[43,5,43,8],[42,5,42,8],[43,2,43,4],[47,2,61,10],[46,2,46,10],[71,2,71,3],[72,2,72,3],[73,2,73,3],[44,2,44,4],[44,5,44,8],[45,5,45,8],[45,2,45,4],[64,2,64,9],[65,2,65,9],[66,2,66,9],[67,2,67,9],[40,5,40,8],[213,8,213,10],[226,2,226,8],[225,2,225,8],[227,2,227,8],[184,10,185,10],[259,5,259,10],[36,2,36,3],[37,2,37,3],[24,4,24,10],[25,4,25,10],[26,4,26,10],[27,4,27,10],[28,4,28,10],[98,2,98,7],[99,2,99,7],[29,2,29,10],[30,4,30,10],[31,4,31,10],[32,2,32,10],[33,4,33,10],[34,4,34,10],[35,4,35,10],[95,2,95,8],[94,2,94,8],[257,2,259,3],[230,2,230,8],[221,2,221,12],[222,2,222,12],[223,2,223,12],[216,2,216,12],[217,2,217,12],[215,2,215,12],[218,2,218,12],[219,2,219,12],[220,2,220,12],[83,2,85,8],[78,2,78,8],[89,2,89,4],[38,2,38,3],[260,5,260,10],[139,2,152,2],[122,3,124,3],[125,2,137,2],[124,4,124,7],[110,2,110,8],[122,4,122,7],[122,2,124,2],[188,2,188,3],[190,2,190,3],[196,2,196,3],[184,4,184,7],[252,2,252,13],[253,2,253,13],[100,3,100,8],[104,2,104,8],[105,2,105,8],[106,2,106,8],[257,5,257,10],[258,5,258,10],[90,2,90,4],[76,6,76,7],[80,2,81,2],[88,2,88,8],[1,2,1,14],[3,2,3,10],[2,2,2,10],[191,2,191,3],[251,2,251,13],[240,2,240,3],[239,2,239,3],[241,2,241,3],[243,2,243,3],[244,2,244,3],[245,2,245,3],[246,2,246,3],[249,2,249,13],[250,2,250,13],[178,2,178,3],[89,5,89,6],[89,7,89,8],[69,2,69,8],[70,2,70,8],[82,2,82,8]]}
[]
[]
[null,null,"Wniosek o pożyczkę w ramach Projektu Systemowego "]
[null,null,"„Wsparcie inżynierii finansowej na rzecz rozwoju ekonomii społecznej”"]
[null,null,"Wzór wniosku o pożyczkę w ramach Projektu Systemowego „Wsparcie inżynierii finansowanej na rzecz rozwoju ekonomii społecznej”"]
[null,null,"Tytuł przedsięwzięcia ",null," ",null,null,null,null,null,null,null,"proszę wypełniać wyłącznie białe pola"]
{"$rows_left_out":260}
{"sheet":"harm_pożyczki es","index":2,"n_rows":108,"n_cols":33,"rows_kept":108,"cut":false,"hidden":true,"merged":[[1,14,1,15],[2,2,2,3],[2,17,2,18],[2,29,2,31]]}
[null,null,null,null,null,"Harmonogram annuitetowy",null,null,null,null,null,null,null,null,null,null,null,null,null,null,"Harmonogram tradycyjny"]
[null,null,null,null,null,null,null,null,null,null,null,null,null,null,"Założenia kredytu"]
[null,null,"Formuły pomocnicze",null,null,"numer okresu","dat końca okresu",null,"stała kwota płatności /pmt/","rata kapitału  kredytu w danym okresie         /ppmt/","rata odsetkowa w danym okresie           /ipmt/","odsetki do zapłaty narastająco  /cumipmt lub splac.ods/","kwota kredytu pozostałego do spłaty /pv/",null,"oprocentowanie roczne",{"$f":"'1_wniosek'!T9","v":0},null,"Formuły pomocnicze",null,null,"numer okresu","dat końca okresu",null,"rata kapitału kredytu w danym okresie        ","spłaty rat kred narastająco","rata odsetkowa w danym okresie          ","odsetki do zapłaty narastająco","kwota kredytu pozostałego do spłaty na koniec okresu",null,"Formuły pomocnicze"]
[null,null,{"$f":"P8","v":0},0,null,0,{"$f":"P6","v":"2014-08-31"},null,null,null,null,null,{"$f":"PV($P$7,C4,$I$5,0,0)*-1","v":{"$error":"#NUM!"}},null,"liczba miesięcy",{"$f":"'1_wniosek'!I77","v":0},null,{"$f":"P8","v":0},0,null,0,{"$f":"P6","v":"2014-08-31"},null,null,null,null,null,{"$f":"P5","v":0},null,"oprocentowanie","liczba okresów","data"]
[null,null,{"$f":"IF(C4-1>=0,C4-1,0)","v":0},{"$f":"IF(C4>0,D4+1,0)","v":0},null,{"$f":"IF(D5=0,\"\",D5)","v":""},{"$f":"IF(D5=0,\"\",EOMONTH(G4,$AF$8))","v":""},null,{"$f":"PMT(P7,P8,-$P$5,,0)","v":{"$error":"#NUM!"}},{"$f":"IF(I5=\"\",\"\",(PPMT($P$7,D5,$P$8,-$P$5)))","v":{"$error":"#NUM!"}},{"$f":"IPMT($P$7,F5,$P$8,-$P$5)","v":{"$error":"#VALUE!"}},{"$f":"CUMIPMT($P$7,$P$8,$P$5,1,F5,0)*-1","v":{"$error":"#VALUE!"}},{"$f":"IF(F5>0,M4-J5,\"\")","v":{"$error":"#NUM!"}},null,"kwota kredytu",{"$f":"'1_wniosek'!E9","v":0},null,{"$f":"IF(R4-1>=0,R4-1,0)","v":0},{"$f":"IF(R4>0,S4+1,0)","v":0},null,1,{"$f":"IF(S5=0,\"\",EOMONTH(V4,$AF$8))","v":""},null,{"$f":"IF(AND(S5<=$P$9,S5>0),0,IF(S5=0,\"\",$AF$10))","v":""},{"$f":"IF(AND(S5>$P$9,S5>0),(S5-$P$9)*$AF$10,0)","v":0},{"$f":"IF(S5=0,\"\",AB4*$P$7)","v":""},{"$f":"Z5","v":""},{"$f":"IF(AND(S5<$P$9,S5>0),$AB$4,IF(S5>0,$AB$4-(S5-$P$9)*$AF$10,\"\"))","v":""},null,{"$f":"IF(P11=1,P3/12,0)","v":0},{"$f":"IF($P11=1,$P$4,0)","v":0}]
[null,null,0,{"$f":"IF(C5>0,D5+1,0)","v":0},null,{"$f":"IF(D6=0,\"\",D6)","v":""},{"$f":"IF(D6=0,\"\",EOMONTH(G5,$AF$8))","v":""},null,{"$f":"IF(D6=0,\"\",I5)","v":""},{"$f":"IF(I6=\"\",\"\",(PPMT($P$7,D6,$P$8,-$P$5)))","v":""},{"$f":"IF(J6=\"\",\"\",(IPMT($P$7,D6,$P$8,-$P$5)))","v":""},{"$f":"IF(K6=\"\",\"\",(CUMIPMT($P$7,$P$8,$P$5,1,F6,0)*-1))","v":""},{"$f":"IF(F6>0,M5-J6,\"\")","v":{"$error":"#NUM!"}},null,"data udostępnienia kredytu",{"$f":"'1_wniosek'!D77","v":"2014-08-31"},null,0,{"$f":"IF(R5>0,S5+1,0)","v":0},null,{"$f":"IF(S6=0,\"\",S6)","v":""},{"$f":"IF(S6=0,\"\",EOMONTH(V5,$AF$8))","v":""},null,"",{"$f":"IF(AND(S6>$P$9,S6>0),(S6-$P$9)*$AF$10,0)","v":0},{"$f":"IF(S6=0,\"\",AB5*$P$7)","v":""},{"$f":"IF(S6=0,\"\",AA5+Z6)","v":""},{"$f":"IF(AND(S6<$P$9,S6>0),$AB$4,IF(S6>0,$AB$4-(S6-$P$9)*$AF$10,\"\"))","v":""},null,{"$f":"IF(P12=1,P3/4,0)","v":0},{"$f":"IF($P12=1,$P$4/3,0)","v":0}]
{"$rows_left_out":103}
{"sheet":"Wniosek _1","index":3,"n_rows":89,"n_cols":13,"rows_kept":89,"cut":false,"hidden":true,"merged":[[88,1,88,6],[89,1,89,6],[72,2,72,6],[73,2,73,6],[74,2,74,6],[75,2,75,6],[76,2,76,6],[77,2,77,6],[66,2,66,6],[67,2,67,6],[68,2,68,6],[69,2,69,6],[70,2,70,6],[71,2,71,6],[56,1,56,6],[57,1,57,6],[42,1,42,6],[60,1,60,4],[61,1,61,3],[62,1,62,4],[63,1,63,4],[53,2,53,4],[53,5,53,6],[54,2,54,4],[54,5,54,6],[55,1,55,4],[55,5,55,6],[50,2,50,4],[50,5,50,6],[51,2,51,4],[51,5,51,6],[52,2,52,4],[52,5,52,6],[45,2,45,6],[46,1,46,2],[47,2,47,6],[48,2,48,4],[48,5,48,6],[49,2,49,4],[49,5,49,6],[44,2,44,4],[44,5,44,6],[15,2,15,5],[16,2,16,5],[17,2,17,5],[18,2,18,5],[28,1,28,6],[20,1,20,6],[22,1,22,6],[32,1,33,1],[34,1,35,1],[36,1,37,1],[38,1,39,1],[2,2,2,6],[3,2,3,6],[4,2,4,6],[29,1,29,2],[30,1,31,1],[5,2,5,6],[13,1,13,5],[11,1,11,5],[9,1,9,5]]}
[]
[]
[null,"Tytuł przedsięwzięcia "]
[null,"Nazwa Wnioskodawcy"]
[null,"Wnioskowana kwota pożyczki"]
[null,"Wartość stopy redyskonta na dzień składania wniosku"]
{"$rows_left_out":84}
{"sheet":"1","index":4,"n_rows":247,"n_cols":18,"rows_kept":247,"cut":false,"hidden":true,"merged":[[7,4,7,5],[7,6,7,7],[20,2,20,3],[50,4,51,4],[51,1,51,3],[60,1,60,5],[240,3,240,6],[243,3,243,6],[244,3,244,6],[241,3,241,6],[242,3,242,6],[10,1,10,2],[12,1,12,2],[14,1,14,2],[102,1,102,6],[30,1,30,6],[46,1,46,6],[104,1,104,6],[197,3,197,4],[198,1,198,2],[198,3,198,4],[183,1,183,3],[191,3,191,4],[192,3,192,4],[245,3,245,6],[107,1,107,6],[108,1,108,6],[109,1,109,6],[110,1,110,6],[234,1,234,4],[235,1,235,4],[236,1,236,4],[112,1,112,6],[166,2,166,10],[240,2,245,2],[211,1,211,3],[212,1,212,3],[213,1,213,3],[214,1,214,3],[215,1,215,3],[216,1,216,3],[205,1,205,3],[206,1,206,3],[232,1,232,4],[233,1,233,4],[196,1,196,2],[196,3,196,4],[197,1,197,2],[193,1,193,4],[92,1,92,5],[93,1,93,6],[96,1,96,6],[97,1,97,6],[98,1,98,6],[207,1,207,3],[208,1,208,3],[209,1,209,3],[150,4,152,4],[150,5,152,5],[161,1,161,2],[161,3,161,9],[179,1,179,3],[148,1,148,10],[149,1,152,1],[149,2,149,5],[149,6,152,6],[149,7,152,7],[149,8,152,8],[149,9,152,9],[149,10,152,10],[150,3,152,3],[128,1,128,2],[210,1,210,3],[199,1,199,4],[200,1,200,3],[201,1,201,3],[202,1,202,3],[203,1,203,3],[204,1,204,3],[194,1,194,2],[194,3,194,4],[132,1,132,9],[133,1,136,1],[133,2,133,5],[134,3,138,3],[134,4,138,4],[134,5,138,5],[133,6,138,6],[133,7,138,7],[133,8,138,8],[133,9,138,9],[116,1,116,5],[117,1,118,3],[119,1,120,1],[119,3,120,3],[119,4,120,4],[119,5,120,5],[99,1,99,6],[100,1,100,6],[101,1,101,6],[62,1,62,6],[65,1,65,2],[57,2,57,4],[57,5,57,6],[58,2,58,4],[58,5,58,6],[59,2,59,4],[59,5,59,6],[68,1,68,2],[4,2,4,6],[5,2,5,6],[22,1,22,6],[24,1,24,2],[70,2,70,6],[32,1,32,2],[33,1,34,1],[35,1,36,1],[37,1,38,1],[39,1,40,1],[41,1,42,1],[54,2,54,4],[54,5,54,6],[55,2,55,4],[55,5,55,6],[56,2,56,4],[56,5,56,6],[48,2,48,4],[48,5,48,6],[50,1,50,2],[52,2,52,6],[53,2,53,4],[53,5,53,6],[61,1,61,6]]}
[1]
[null,"Wniosek o pożyczkę w ramach Projektu Systemowego "]
[null,"„Wsparcie inżynierii finansowej na rzecz rozwoju ekonomii społecznej”"]
[null,"Metryka "]
[null,"Tytuł przedsięwzięcia "]
[null,"Nazwa Wnioskodawcy"]
{"$rows_left_out":242}
{"sheet":"2","index":5,"n_rows":2,"n_cols":5,"rows_kept":2,"cut":false,"hidden":true,"merged":[]}
[2,"Załącznik B"]
[null,"oswiadczenie  o MSP",null,null,"do uzupełnienia"]

{"sheet":"2_zał_H_zabezp","index":6,"n_rows":23,"n_cols":17,"rows_kept":23,"cut":false,"hidden":false,"merged":[[0,1,1,4],[22,2,22,5]]}
[]
[]
[null,"Załącznik H.  Proponowane zabezpieczenia"]
[]
[null,"Lp.","Rodzaj proponowanego zabezpieczenia","Krótki  opis proponowanego zabezpieczenia","Wartość szacowana przez Wnioskodawcę w tys. zł.","Ocena zbywalności/ dokonana przez Wnioskodawcę/","Wartość zweryfikowana/wypełnia  TISE/","Weryfikacja oceny zbywalności - wypełnia TISE",null,null,null,null,null,null,null,"wsk zabezpieczeń",{"$f":"F22/'1_wniosek'!E9","v":{"$error":"#DIV/0!"}}]
[null,"I.","Zabezpieczenia osobiste"," ",null,"nie dotyczy",{"$f":"E6","v":0},"nie dotyczy",null,null,null,null,"bardzo dobra",null,null,{"$f":"IF(E6>0,1,0)","v":0}]
{"$rows_left_out":18}
{"sheet":"3_Zał_F_dane fin i zał_klient","index":7,"n_rows":55,"n_cols":21,"rows_kept":55,"cut":false,"hidden":false,"merged":[[47,2,47,3],[28,2,28,13],[29,2,30,2],[36,2,36,13],[42,2,42,13],[43,2,44,3],[45,2,45,3],[37,2,38,3],[39,2,39,3],[18,8,18,9],[19,8,19,9],[20,8,20,9],[22,2,22,13],[46,2,46,3],[24,2,24,3],[25,2,25,3],[26,2,26,3],[27,2,27,3],[14,4,14,5],[14,8,14,9],[15,8,15,9],[16,8,16,9],[17,8,17,9],[6,4,6,5],[6,8,6,9],[5,4,5,5],[5,8,5,9],[0,2,0,14],[3,12,3,14],[3,2,3,6],[3,8,3,10],[4,4,4,5],[4,8,4,9],[7,4,7,5],[7,8,7,9],[8,4,8,5],[8,8,8,9],[9,4,9,5],[9,8,9,9],[10,4,10,5],[10,8,10,9],[11,2,13,2],[11,3,13,3],[11,4,11,5],[11,8,11,9],[12,4,12,5],[12,8,12,9],[13,4,13,5],[13,8,13,9]]}
[]
[null,null,"Załącznik F. Dane finansowe i założenia"]
["I.",null,"Uproszczone sprawozdania z dotychczasowej działalności "]
[null,null,"Bilans ",null,null,null,null,null,"Uproszczony Rachunek zysków i strat",null,null,null,"Struktura nalezności i zobowiązań"]
[null,null,"Aktywa",2013,"Pasywa",null,{"$f":"D5","v":2013},null,"rzis",null,{"$f":"G5","v":2013},null,"Wyszczególnienie","koniec roku","koniec kw …",null,null,null,2012,360,{"$f":"VLOOKUP(D5,S5:T11,2,FALSE)","v":360}]
[null,null,"Aktywa trwałe",null,"Kapitały własne",null,{"$f":"D15-G8-G9-G12-G13-G14","v":0},null,"I. Przychody ogółem (II+III+IV+V), z tego",null,{"$f":"SUM(K7:K10)","v":0},null,"Nalezności  ogółem , z tego",null,null,null,null,null,"I kw 2013",90]
{"$rows_left_out":50}
{"sheet":"4","index":8,"n_rows":2,"n_cols":8,"rows_kept":2,"cut":false,"hidden":true,"merged":[[1,1,1,5]]}
[]
[null,"oświadczenie że Wnioskodawca  nie podlega wykluczeniu z ubiegania się o dofinansowanie na podst art. 207 Ustawy o finansach pulicznych",null,null,null,null,null,"do uzupełnienia"]

{"sheet":"5","index":9,"n_rows":69,"n_cols":18,"rows_kept":69,"cut":false,"hidden":true,"merged":[[64,2,64,3],[53,1,53,3],[54,1,54,3],[59,2,59,3],[60,2,60,3],[61,2,61,3],[63,2,63,3],[62,2,62,3],[39,1,39,3],[10,2,10,3],[11,2,11,3],[29,4,29,12],[38,2,38,3],[12,2,12,3],[15,2,15,3],[34,2,34,3],[17,4,19,4],[16,14,20,17],[8,2,8,3],[4,2,4,3],[5,2,5,3],[6,2,6,3],[7,2,7,3],[16,2,19,2],[16,4,16,7],[17,5,19,5],[17,6,19,6],[17,7,19,7],[16,3,19,3],[9,2,9,3]]}
[5]
[null,"Założenia dotyczące planowanego przedsięwzięcia  ( w tys. zł.)",null,null,"1 kw","2 kw","3 kw","4 kw","razem  1 rok","2 rok","3 rok","4 rok","5 rok","6 rok",null,null,null,"dec - ujęcie kalendarzowe"]
[null,null,"liczba dni w okresie",null,90,90,90,90,360,360,360,360,360,360]
[null,"1.","Planowane przychody ogółem, z tego:",null,{"$f":"SUM(E5:E8)","v":0},{"$f":"SUM(F5:F8)","v":0},0,0,0,0,0,0,0,{"$f":"SUM(N5:N8)","v":0}]
[null,"1a.",null,null,{"$f":"'1_wniosek'!E180","v":0},{"$f":"'1_wniosek'!F180","v":0},{"$f":"'1_wniosek'!G180","v":0},{"$f":"'1_wniosek'!H180","v":0},{"$f":"'1_wniosek'!I180","v":0},{"$f":"'1_wniosek'!J180","v":0},{"$f":"'1_wniosek'!K180","v":0},{"$f":"'1_wniosek'!L180","v":0},{"$f":"'1_wniosek'!M180","v":0},{"$f":"'1_wniosek'!N180","v":0}]
[null,"1b.",null,null,null,null,null,null,{"$f":"SUM(E6:H6)","v":0}]
{"$rows_left_out":64}
{"sheet":"3a_projekcje_klient ","index":10,"n_rows":85,"n_cols":27,"rows_kept":85,"cut":false,"hidden":false,"merged":[[45,2,45,14],[0,3,0,14]]}
[]
[null,null,null,"projekcje  - wyliczane automatycznie"]
[null,null,null,"Aktywa",{"$f":"'3_Zał_F_dane fin i zał_klient'!G5","v":2013},{"$f":"'1_wniosek'!E124","v":"Kwartał 1"},{"$f":"'1_wniosek'!F124","v":"Kwartał 2"},{"$f":"'1_wniosek'!G124","v":"Kwartał 3"},{"$f":"'1_wniosek'!H124","v":"Kwartał 4"},{"$f":"'1_wniosek'!I123","v":2014},{"$f":"'1_wniosek'!J157","v":2015},{"$f":"'1_wniosek'!K157","v":2016},{"$f":"'1_wniosek'!L157","v":2017},{"$f":"'1_wniosek'!M157","v":2018},{"$f":"'1_wniosek'!N157","v":2019},null,null,null,{"$f":"F3","v":"Kwartał 1"},{"$f":"G3","v":"Kwartał 2"},"Kwartał 3","Kwartał 4",null,"nie dotyczy",1,null,"wersja 08.01.2014"]
[null,null,null,"Aktywa trwałe",{"$f":"'5_projekcje'!D3","v":0},{"$f":"'5_projekcje'!E3","v":0},{"$f":"'5_projekcje'!F3","v":0},{"$f":"'5_projekcje'!G3","v":0},{"$f":"'5_projekcje'!H3","v":0},{"$f":"'5_projekcje'!I3","v":0},{"$f":"'5_projekcje'!J3","v":0},{"$f":"'5_projekcje'!K3","v":0},{"$f":"'5_projekcje'!L3","v":0},{"$f":"'5_projekcje'!M3","v":0},{"$f":"'5_projekcje'!N3","v":0},null,null,null,{"$f":"VLOOKUP(F3,'1_wniosek'!$AB$124:$AC$128,2,FALSE)","v":90},{"$f":"VLOOKUP(G3,'1_wniosek'!$AB$124:$AC$128,2,FALSE)","v":180},{"$f":"VLOOKUP(H3,'1_wniosek'!$AB$124:$AC$128,2,FALSE)","v":270},{"$f":"VLOOKUP(I3,'1_wniosek'!$AB$124:$AC$128,2,FALSE)","v":360}]
[null,null,null,"Zapasy",{"$f":"'5_projekcje'!D4","v":0},{"$f":"'5_projekcje'!E4","v":0},{"$f":"'5_projekcje'!F4","v":0},{"$f":"'5_projekcje'!G4","v":0},{"$f":"'5_projekcje'!H4","v":0},{"$f":"'5_projekcje'!I4","v":0},{"$f":"'5_projekcje'!J4","v":0},{"$f":"'5_projekcje'!K4","v":0},{"$f":"'5_projekcje'!L4","v":0},{"$f":"'5_projekcje'!M4","v":0},{"$f":"'5_projekcje'!N4","v":0},null,null,null,{"$f":"S4","v":90},{"$f":"T4","v":180},270,360,{"$f":"SUM(S5:V5)","v":900}]
[null,null,null,"Należności",{"$f":"'5_projekcje'!D5","v":0},{"$f":"'5_projekcje'!E5","v":0},{"$f":"'5_projekcje'!F5","v":0},{"$f":"'5_projekcje'!G5","v":0},{"$f":"'5_projekcje'!H5","v":0},{"$f":"'5_projekcje'!I5","v":0},{"$f":"'5_projekcje'!J5","v":0},{"$f":"'5_projekcje'!K5","v":0},{"$f":"'5_projekcje'!L5","v":0},{"$f":"'5_projekcje'!M5","v":0},{"$f":"'5_projekcje'!N5","v":0}]
{"$rows_left_out":80}
{"sheet":"3_Zał_F_TISE","index":11,"n_rows":54,"n_cols":15,"rows_kept":54,"cut":false,"hidden":true,"merged":[[2,2,2,6],[6,4,6,5],[12,4,12,5],[7,8,7,9],[11,8,11,9],[12,8,12,9],[10,2,12,2],[4,8,4,9],[3,8,3,9],[6,8,6,9],[3,4,3,5],[4,4,4,5],[5,4,5,5],[5,8,5,9],[7,4,7,5],[8,4,8,5],[17,8,17,9],[2,12,2,14],[2,8,2,10],[8,8,8,9],[9,8,9,9],[10,8,10,9],[9,4,9,5],[10,4,10,5],[11,4,11,5],[46,2,46,3],[45,2,45,3],[10,3,12,3],[18,8,18,9],[13,4,13,5],[23,2,23,3],[44,2,44,3],[42,2,43,3],[28,2,29,2],[35,2,35,13],[41,2,41,13],[27,2,27,13],[36,2,37,3],[21,2,21,13],[13,8,13,9],[19,8,19,9],[14,8,14,9],[15,8,15,9],[16,8,16,9]]}
[null,null,"Załącznik F. Dane finansowe i założenia"]
["I.",null,"Uproszczone sprawozdania z dotychczasowej działalności "]
[null,null,"Bilans ",null,null,null,null,null,"Uproszczony Rachunek zysków i strat",null,null,null,"Struktura nalezności i zobowiązań"]
[null,null,"Aktywa",{"$f":"'3_Zał_F_dane fin i zał_klient'!D5","v":2013},"Pasywa",null,{"$f":"'3_Zał_F_dane fin i zał_klient'!G5","v":2013},null,"rzis",null,{"$f":"'3_Zał_F_dane fin i zał_klient'!K5","v":2013},null,"Wyszczególnienie",{"$f":"'3_Zał_F_dane fin i zał_klient'!N5","v":"koniec roku"},{"$f":"'3_Zał_F_dane fin i zał_klient'!O5","v":"koniec kw …"}]
[null,null,"Aktywa trwałe",{"$f":"'3_Zał_F_dane fin i zał_klient'!D6","v":0},"Kapitały własne",null,{"$f":"D14-G7-G8-G11-G12-G13","v":0},null,"I. Przychody ogółem (II+III+IV+V), z tego",null,{"$f":"K6+K7+K8+K9","v":0},null,"Nalezności  ogółem , z tego",{"$f":"'3_Zał_F_dane fin i zał_klient'!N6","v":0},{"$f":"'3_Zał_F_dane fin i zał_klient'!O6","v":0}]
[null,null,"Zapasy",{"$f":"'3_Zał_F_dane fin i zał_klient'!D7","v":0},"w tym wynik netto",null,{"$f":"K20","v":0},null,"II. Przychody  z działalności gospodarczej , ze sprzedaży produktów, usług i towarów ogółem",null,{"$f":"'3_Zał_F_dane fin i zał_klient'!K7","v":0},null,"nieprzeterminowane",{"$f":"'3_Zał_F_dane fin i zał_klient'!N7","v":0},{"$f":"'3_Zał_F_dane fin i zał_klient'!O7","v":0}]
{"$rows_left_out":49}
{"sheet":"7","index":12,"n_rows":73,"n_cols":16,"rows_kept":73,"cut":false,"hidden":true,"merged":[[27,1,27,2],[1,1,1,3],[3,2,3,3],[4,2,4,3],[5,2,5,3],[6,2,6,3],[7,2,7,3],[15,2,15,3],[16,2,16,3],[17,2,17,3],[18,2,18,3],[20,2,20,3],[9,2,9,3],[39,1,39,12],[54,1,54,2],[53,1,53,12],[40,1,40,2],[33,1,33,2]]}
[7]
[null,"Założenia dotyczące dotychczasowej działalności  ( w tys. zł.)",null,null,"1 kw","2 kw","3 kw","4 kw","razem  1 rok","2 rok","3 rok","4 rok","5 rok","5 rok"]
[null,"1.","Planowane przychody ogółem, z tego:",null,{"$f":"E4","v":0},{"$f":"F4","v":0},0,0,0,0,0,0,0,0,"popr 30.09"]
[null,"1a.","Przychody ze sprzedaży",null,{"$f":"'1_wniosek'!E188-'1_wniosek'!E190","v":0},{"$f":"'1_wniosek'!F188-'1_wniosek'!F190","v":0},{"$f":"'1_wniosek'!G188-'1_wniosek'!G190","v":0},{"$f":"'1_wniosek'!H188-'1_wniosek'!H190","v":0},{"$f":"'1_wniosek'!I188-'1_wniosek'!I190","v":0},{"$f":"'1_wniosek'!J188-'1_wniosek'!J190","v":0},{"$f":"'1_wniosek'!K188-'1_wniosek'!K190","v":0},{"$f":"'1_wniosek'!L188-'1_wniosek'!L190","v":0},{"$f":"'1_wniosek'!M188-'1_wniosek'!M190","v":0},{"$f":"'1_wniosek'!N188-'1_wniosek'!N190","v":0},"popr 13.10"]
[null,"1b.","Pozostałe przychody operacyjne - razem,  z tego",null,{"$f":"E6-E7+E8","v":{"$error":"#REF!"}},{"$f":"F6-F7+F8","v":{"$error":"#REF!"}},{"$error":"#REF!"},{"$error":"#REF!"},{"$f":"SUM(E5:H5)","v":{"$error":"#REF!"}},{"$f":"J6-J7+J8","v":{"$error":"#REF!"}},{"$f":"K6-K7+K8","v":{"$error":"#REF!"}},{"$f":"L6-L7+L8","v":{"$error":"#REF!"}},{"$f":"M6-M7+M8","v":{"$error":"#REF!"}},{"$error":"#REF!"}]
[null,"1b.1.","planowana wartość sprzedaży  aktywów  trwałych",null,{"$f":"'1_wniosek'!#REF!","v":{"$error":"#REF!"}},{"$f":"'1_wniosek'!#REF!","v":{"$error":"#REF!"}},{"$f":"'1_wniosek'!#REF!","v":{"$error":"#REF!"}},{"$f":"'1_wniosek'!#REF!","v":{"$error":"#REF!"}},{"$f":"'1_wniosek'!#REF!","v":{"$error":"#REF!"}},{"$f":"'1_wniosek'!#REF!","v":{"$error":"#REF!"}},{"$f":"'1_wniosek'!#REF!","v":{"$error":"#REF!"}},{"$f":"'1_wniosek'!#REF!","v":{"$error":"#REF!"}},{"$f":"'1_wniosek'!#REF!","v":{"$error":"#REF!"}},{"$f":"'1_wniosek'!#REF!","v":{"$error":"#REF!"}}]
{"$rows_left_out":68}
{"sheet":"4_założenia KO","index":13,"n_rows":23,"n_cols":13,"rows_kept":23,"cut":false,"hidden":true,"merged":[[3,1,4,2],[5,1,5,2],[6,1,6,2],[7,1,7,2]]}
[]
[null,"Założenia  wypełniane przez TISE na podstawie wywiadu"]
[null,"Założenia dotyczące nowego przedsięwzięcia"]
[null,"Planowane zmiany kapitału obrotowego - w dniach",null,"1 kw 2013","2 kw","3 kw","4 kw",2013,2014,2015,2016,2017,2018]
[null,null,null,{"$f":"D7-D6-D8","v":0},{"$f":"E7-E6-E8","v":0},0,0,0,0,0,0,0,{"$f":"M7-M6-M8","v":0}]
[null,"jaki zakładasz średni czas / w dniach/  zapłaty  przez odbiorców - Twoich  klientów _ w związku ze sprzedażą  wynikającą z planowanego przedsięwzięcia",null,{"$f":"IFERROR(D14,0)","v":0},{"$f":"D6","v":0},{"$f":"E6","v":0},0,0,0,0,0,0,0]
{"$rows_left_out":18}
{"sheet":"5_projekcje","index":14,"n_rows":133,"n_cols":24,"rows_kept":133,"cut":false,"hidden":true,"merged":[[52,1,52,2],[51,1,51,13],[132,2,132,3],[127,2,127,3],[130,2,130,3],[131,2,131,3],[128,2,128,3]]}
[null,null,"projekcje  - wyliczane automatycznie"]
[null,null,"Aktywa",{"$f":"'3_Zał_F_dane fin i zał_klient'!G5","v":2013},{"$f":"'1_wniosek'!E124","v":"Kwartał 1"},{"$f":"'1_wniosek'!F124","v":"Kwartał 2"},{"$f":"'1_wniosek'!G124","v":"Kwartał 3"},{"$f":"'1_wniosek'!H124","v":"Kwartał 4"},{"$f":"'1_wniosek'!I123","v":2014},{"$f":"'1_wniosek'!J157","v":2015},{"$f":"'1_wniosek'!K157","v":2016},{"$f":"'1_wniosek'!L157","v":2017},{"$f":"'1_wniosek'!M157","v":2018},{"$f":"'1_wniosek'!N157","v":2019},null,null,null,{"$f":"E2","v":"Kwartał 1"},{"$f":"F2","v":"Kwartał 2"},{"$f":"G2","v":"Kwartał 3"},{"$f":"H2","v":"Kwartał 4"},null,"nie dotyczy",1]
[null,null,"Aktywa trwałe",{"$f":"'3_Zał_F_TISE'!D5","v":0},{"$f":"IF(R3=0,D3,(D3-E35+'7'!E56))","v":0},{"$f":"IF(S3=0,E3,(E3-F35+'7'!F56))","v":0},{"$f":"IF(T3=0,F3,(F3-G35+'7'!G56))","v":0},{"$f":"IF(U3=0,G3,(G3-H35+'7'!H56))","v":0},{"$f":"H3","v":0},{"$f":"I3-J35+'7'!J56","v":0},{"$f":"J3-K35+'7'!K56","v":0},{"$f":"K3-L35+'7'!L56","v":0},{"$f":"L3-M35+'7'!M56","v":0},{"$f":"M3-N35+'7'!N56","v":0},null,null,null,{"$f":"VLOOKUP(E2,'1_wniosek'!$AB$124:$AC$128,2,FALSE)","v":90},{"$f":"VLOOKUP(F2,'1_wniosek'!$AB$124:$AC$128,2,FALSE)","v":180},{"$f":"VLOOKUP(G2,'1_wniosek'!$AB$124:$AC$128,2,FALSE)","v":270},{"$f":"VLOOKUP(H2,'1_wniosek'!$AB$124:$AC$128,2,FALSE)","v":360}]
[null,null,"Zapasy",{"$f":"'3_Zał_F_TISE'!D6","v":0},{"$f":"IFERROR(IF(R3=0,D4,'7'!E73),0)","v":0},{"$f":"IFERROR(IF(S3=0,E4,'7'!F73),0)","v":0},{"$f":"IFERROR(IF(T3=0,F4,'7'!G73),0)","v":0},{"$f":"IFERROR(IF(U3=0,G4,'7'!H73),0)","v":0},{"$f":"H4","v":0},{"$f":"IFERROR('7'!J73,0)","v":0},{"$f":"IFERROR('7'!K73,0)","v":0},{"$f":"IFERROR('7'!L73,0)","v":0},{"$f":"IFERROR('7'!M73,0)","v":0},{"$f":"IFERROR('7'!N73,0)","v":0},null,null,null,{"$f":"R3","v":90},{"$f":"S3","v":180},{"$f":"T3","v":270},{"$f":"U3","v":360},{"$f":"SUM(R4:U4)","v":900}]
[null,null,"Należności",{"$f":"D6+D7","v":0},{"$f":"E6+E7","v":0},{"$f":"F6+F7","v":0},{"$f":"G6+G7","v":0},{"$f":"H6+H7","v":0},{"$f":"H5","v":0},{"$f":"J6+J7","v":0},{"$f":"K6+K7","v":0},{"$f":"L6+L7","v":0},{"$f":"M6+M7","v":0},{"$f":"N6+N7","v":0}]
[null,null," - od odbiorców /handlowe/",{"$f":"'3_Zał_F_TISE'!D8","v":0},{"$f":"IF(R3=0,D6,'7'!E71)","v":0},{"$f":"IF(S3=0,E6,'7'!F71)","v":0},{"$f":"IF(T3=0,F6,'7'!G71)","v":0},{"$f":"IF(U3=0,G6,'7'!H71)","v":0},{"$f":"H6","v":0},{"$f":"'7'!J71","v":0},{"$f":"'7'!K71","v":0},{"$f":"'7'!L71","v":0},{"$f":"'7'!M71","v":0},{"$f":"'7'!N71","v":0},null,null,null,{"$f":"'1_wniosek'!E187","v":"prognoza"},{"$f":"'1_wniosek'!F187","v":"prognoza"},{"$f":"'1_wniosek'!G187","v":"prognoza"},{"$f":"'1_wniosek'!H187","v":"prognoza"}]
{"$rows_left_out":128}
{"sheet":"10","index":15,"n_rows":0,"n_cols":0,"rows_kept":0,"cut":false,"hidden":true,"merged":[]}